BDBM50376576 CHEMBL265449
SMILES CC(C)(C)c1nc2cc(ccc2n1CC1CCOCC1)S(=O)(=O)c1c(Cl)cccc1Cl
InChI Key InChIKey=DEJWIJDVKUDRRN-UHFFFAOYSA-N
Data  1 EC50
  Tab Delimited (TSV)   2D SDfile   Computed 3D by Vconf -m prep SDfile
Find this compound or compounds like it in BindingDB:
Activity Spreadsheet -- Enzyme Inhibition Constant Data from BindingDB
Found 1 hit for monomerid = 50376576
TargetCannabinoid receptor 2(Homo sapiens (Human))
Johnson & Johnson Pharmaceutical Research & Development
Curated by ChEMBL
LigandPNGBDBM50376576(CHEMBL265449)
Affinity DataEC50:  0.400nM. Assay description: Agonist activity at human CB2 receptor
In DepthDetails ArticlePubMed